Xcode Clang Error



6 thoughts on “ OpenMP Clang in Xcode ” John Nairn November 27, 2016 at 9:16 am. I'm not the maintainer of our gcc ports, but I am the one who created our gcc5 port and kept it updated until version 5-20140824. a while back, we came across the compile time issue 'clang: error: unable to execute command: Segmentation fault: This site uses cookies for analytics, personalized content and ads. It is kind of out of hand @ unity they can only update the prepacked GVR SDK pods folder. same directory as your Xcode project file You should search for error: in the Xcode logs, in 99% of the cases that'll be. 3f1, Vuforia 8. Current release: valgrind-3. 1,然后调试接了一台iPhone4,一台iPhone5,(原来只用iPhone4开发) 选择. " that occurs when I run qmake on a default console project. with Cordova Plugin: use of '@import' when modules are This works just fine in Xcode. Lines 13 to 17 then select the compiler, clang for OS X and g++ for Linux. Possible Xcode 6. Emit Clang AST files for source inputs-enable-trivial-auto-var-init-zero-knowing-it-will-be-removed-from-clang¶ Trivial automatic variable initialization to zero is only here for benchmarks, it'll eventually be removed, and I'm OK with that because I'm only using it to benchmark-exported_symbols_list ¶-faligned-new=¶. 2 and seems to compile and work fine. Our sophisticated back-end offers publishers and app owners a best-in-class solution for mobile content management. I add the same problem, thanks to martindeveloper I found the findcudalib. NOTE: This is an experimental flag, that might go away or be renamed. READ BEFORE POSTING. There's so much more you can do. Hello, I'm a developer with the MacPorts project. Hi, I'm trying to build clang and llvm using Xcode. 2 was removed starting with 4. 2 Apple Mach-o Linker (id) Error When I try to build for device, Xcode build hangs on following Mach-O linker error: Undefined symbols Unity. CLion supports only CMake-based projects for now. noloader changed the title compilation failures with clang from xcode 9. Notice that I get the error even when just installing the binary from here: Then following instruction from this page But I didn't had Xcode. I went through the config file as you suggested and realized that ccache may have been an alias in @kylebmetrum Makevars. is based on llvm 7. It does, however, solve the immediate problem (not being able to install certain gems), and is sufficient untill the maintainers of the gems update their projects to not violate the treat-warnings-as-errors constraint. framework file into your project. Lines 37 to 41 set the platform specific compiler flags. The code below this statement is not compiled in Xcode 7 since HAVE_CLOCK_GETTIME is false. Xcode is available for free from Apple’s Developer Site, but you’ll have to do just a bit of work to get it. If you do want to work on the command line, you may as well just use the "clang" program instead. This turns on all the visible Xcode warnings, along with other Clang compiler warnings that Apple has not made visible in the Xcode project settings. Each call can be bin-packed, one-per-line or inconclusive. 2 #pragma clang diagnostic Allows you to suppress, enable, or change the severity of specific diagnostic messages from within your code. xcode-select: error: command line tools are already installed, use “Software Update” to install updates. 1 cannot be imported in Swift 3. I updated to Xcode 8. If that works for you, great. I am looking at downgrading my XCode version to see if it then works. Hope my findings will help someone. html files, info-plist etc) in XCode before compiling the. "Error using mex. Trying to build my project on Xcode 9 beta for iOS 11 I am getting the following two errors. I have this homework assignment which is basically meant to reinforce what we have learned about polymorphism in class (this is C++ by the way). Hello everyone, I am having a rather unfortunate and urgent issue that is preventing me from building any of my apps. :0: error: compile command failed due to signal (use -v to see invocation) 搜: error: unable to execute command: Segmentation fault: 11. my xcode-select pointed to the correct ones, it was trying to use the older tools. No supported compiler was Learn more about mex compiler, xcode, clang MATLAB. The Clang Static Analyzer is a tool that automatically finds bugs in your code, and is a great example of the sort of tool that can be built using the Clang frontend as a library to parse C/C++ code. In your build process, you are also compiling B. Xcode 10 supports on-device debugging for iOS 8 and later, tvOS 9 and later, and watchOS 2 and later. 2 was released concurrently with the release of iOS 5. 4: clang: error: no such file or directory wiki:FAQ#prerelease comment:3 Changed 2 years ago by mndavidoff (Monte Davidoff). pip install ansible 실행시 다음의 에러가 발생했다. certificate and private key pair) matching the team ID “*TEAMID*” were found. Then make sure the added. I had solved it in a previous Linux install with ST2 by updating clang and python but I can’t remember the details…. 9 or Xcode 6. 2 and seems to compile and work fine. 2 compiler in favor of clang and the hybrid Apple llvm-gcc-4. No supported compiler was Learn more about mex compiler, xcode, clang MATLAB. 4) and the second one Xcode 7. Install Homebrew if it is not installed on your Mac machine. About build platform support In an open-source community, for a build platform to be supported, someone has to step up and support it. Over a million developers have joined DZone. Before we go into a detailed explanation of this program, we need to cover the steps involved in compiling and running it. Use unity 2017. 1 will only work with Xcode 11 and iOS 13. 0f3 and xCode Version 8. 1 and Xcode 8. Mach-O Linker error Xcode it comes to Xcode, but my app won't run because I have about a hundred Mach-O linker errors on the side. Still fighting with this? The flag comes from tools/cpp/cc_configure. MacPorts is an easy to use system for compiling, installing, and managing open source software. 8 which is not matching the requirement. @mrjj Release version of 5. Ld "/Users/Adam/Library/Developer/Xcode/DerivedData/Home_Loan_Finder-ciynsbeemzwbzhenhqlhhzbsgebo/Build/Products/Debug-iphonesimulator/Home Loan Finder. Here are some tips on dealing with errors you'll find in Xcode. framework file into your project. 6 with Xcode version 6. 2 days ago · I guess the issue is caused by the Xcode version downloaded online could not install command line tool properly. The directive allows vectorization and interleaving to be enabled or disabled. I believe xcode clang-9. The scheme's container needs to be set to the Xcode project or workspace you want to build. But I'm really inexperienced in C and would appreciate the help from here. the bitcode formats are diverged. There are a bunch of unrelated searches in google when I search it. 19 03:25. Together these define how your application is built. 0f3 and xCode Version 8. Upon running, I got the following error: This is different from:(1) Program received signal SIGSEGV: Segmentation fault - invalid memory reference. Language Compatibility. 4 (I still have Xcode 6. This plugin allows you to execute Clang scan-build against Mac or iPhone XCode projects or other scan-build compatible build tools. Step through OpenCV source when debugging in Macports OpenCV 2. After selecting the Command Line Tools Xcode 6. Additionally, cc may be a symlink to llvm-gcc-4. 4: clang: error: no such file or directory wiki:FAQ#prerelease comment:3 Changed 2 years ago by mndavidoff (Monte Davidoff). Fixing Qt5 with XCode 7 for Sonic Pi compilation. thanks a lot !!. Regards Question Tags: inApp Messaging SDK -iOS. library not found for -llibc++ clang: error: linker command failed with exit code 1 (use -v to see invocation) Sep. 4) I sucesfully imported the project into Xcode and set up the odata SDK for the IDE, but I get. My iOS builds fail with "clang: error: linker command failed with exit code 1". It's free to sign up and bid on jobs. 1 running on Mac OS X (10. 6 with Xcode version 6. をすると下記でコケた。 pythonは brew install python3 でインストールしている。 Collecting mojimoji. There's so much more you can do. It is documented on page 254 of The C Programming Language, Second Edition. 1 (10B61) recently. With the release of Xcode 3. About build platform support In an open-source community, for a build platform to be supported, someone has to step up and support it. I updated to Xcode 8. 53) (based on LLVM 3. Clang implements two kinds of checks with this attribute. So if your gcc/clang doesn't provide the flag, it shouldn't be emitted. Before we go into a detailed explanation of this program, we need to cover the steps involved in compiling and running it. org) to parse source code and turn it into an interim format. clang: error: linker command failed with exit code 1 Now there's obviously something going on with the C-thingy. Xcode Error Starting Executable Derived Data After the lag disappeared so did that option. For instance, you can select several sanitizer tools with conflicting build settings, and Xcode will run all the tests for you and automatically build all the versions you need. (7): In Clang 3. 5 + metaio 6. My iOS builds fail with "clang: error: linker command failed with exit code 1". In your build process, you are also compiling B. (Xcode cannot determine this ahead of time since other projects may not have been built into the shared build directory at the time the information is needed. How to install Apple Xcode Command Line Tools for macOS Sierra. The Clang Compiler is an open-source compiler for the C family of programming languages, aiming to be the best in class implementation of these languages. 3 is the most recent version and Xcode 4 has always been somewhat problematic for Python builds. In your build process, you are also compiling B. 3 {code:java} clang --version Apple LLVM version 8. 2 from GitHub when building on macOS with xCode. However if you have the cpp file for MACFileSystemIterator and want to use it, then include it in your project and also add the Carbon. Problem with building Clang and LLVM using Xcode. This helped me (0). 0 (clang-602. clang: error: clang frontend command failed due to signal (use -v to see invocation) While I was implementing the FirstTime logic I ran into some errors which I didn't. 6 and iOS SDK 4. 3s └─Compiling, linking and signing 0. 5 and Xcode 5 The latest Xcode 5 update seems to have broken nvcc. If you do want to work on the command line, you may as well just use the "clang" program instead. 1s Xcode build do. 7 and later, sized deallocation is only enabled if the user passes the -fsized-deallocation flag. macOS: I have Xcode installed, but I still cannot compile MatConvNet. 40) (based on for architecture x86_64 _ clang: error: linker command failed with exit code 1 (use. This plugin allows you to execute Clang scan-build against Mac or iPhone XCode projects or other scan-build compatible build tools. export ARCHFLAGS= "-Wno-error=unused-command-line-argument-hard-error-in-future" It works for Pillow 2. clang: error: linker command failed with exit Learn more about matlab, xcode, mex compiler, mex, mac MATLAB I'm trying to compile a mex file on MAC OS X 10. 4 and run it on your device. In project's directory I have done the following: sudo gem install cocoapods pod setup pod install Then, in Xcode (open BeardedSpice. 0 and I can compile it with Apple LLVM 5. Still fighting with this? The flag comes from tools/cpp/cc_configure. 0svn) But now with Xcode 7 we only get the following: Apple LLVM version 7. Disabling Clang Compiler Warnings Sep 20, 2011 · 3 minute read Clang. Will try tomorrow then update this. ) edit Try Documentalist , my app that offers fast, offline access to 190+ programmer API docs. ) I added the user MacPorts to the list of users of ~/Applications via Finder's info dialog ⌘-I, granting Read permissions, and then everything started to work as expected. m is to get rid of the Xcode linker errors below. And my mac osx is 10. If you are using mex for something else like creating C/C++/Java libraries, only XCode 6. I just created. xcode clang error (8). Hi, I clone the project and run pod update in terminal to add the CardboardSDK CocoaPod in VideoWidgetDemo project. Lines 37 to 41 set the platform specific compiler flags. executable configuration (See the next section for detail) Configuration. Mac与Windows局域网共享文件夹(互相访问) 阅读数 32162. With the release of Xcode 3. I'm a newbie who is slowly working his way through K&R using Xcode. Fortunately, there's an easy way to install these developer tools without Xcode, saving you lots of disk space by only installing what you need. The workaround is quite simple, run the pip command with the following prefix: ARCHFLAGS=-Wno-error=unused-command-line-argument-hard-error-in-future sudo pip install ansible. I find when using the LLVM based compiler with Xcode that warnings generated by the Clang front end are pretty good and that most times I really do need to fix the code. New Learn more about mac, os x, error, matlabr2015b, install, xcode, c, c++, fortan MATLAB. Apple constantly develops OS X libraries, sometimes introducing changes that make them incompatible with older compilers (both icc and clang). @Yogikipl: I tested and could reproduce your bug, when trying to compile the example Qt Quick Controls 2 - Gallery on my Mac. If you run into an issue in external libraries, we recommend immediately reporting it to the library maintainer so that it gets addressed. There was also a problem with creating the Xcode project from Unity on a Mac (Unity kept crashing), so the Xcode project was created on a PC. I think 100K output for a build from anything but the most complicated system is probably a sign that things have gone wrong somewhere - but that is a more general comment about the state of the industry. /waf configure or set these in your environment variables. git@master. The workaround is quite simple, run the pip command with the following prefix: ARCHFLAGS=-Wno-error=unused-command-line-argument-hard-error-in-future sudo pip install ansible. NSHipster is a journal of the overlooked bits in Objective-C, Swift, and Cocoa. Some of these things can't be done in Appery. It was in Xcode 4 that Apple stopped shipping the "native" gcc-4. 转载请注明:在路上 » 【已解决】Xcode编译出错:Module compiled with Swift 4. Otherwise, search for "xcode 3. This plugin allows you to execute Clang scan-build against Mac or iPhone XCode projects or other scan-build compatible build tools. XCode Tip: Catch More Bugs With The Clang Analyzer. Unity is the ultimate game development platform. I think 100K output for a build from anything but the most complicated system is probably a sign that things have gone wrong somewhere - but that is a more general comment about the state of the industry. 1, C++03, and libstdc++. Fix: Remove any Xcode GM or whatever previous versions you downloaded from developer. My solution is using a side by side installation of Xcode 7 and Xcode 6. This topic has been deleted. as -arch i386 -force_cpusubtype_ALL -o natArray. After selecting the Command Line Tools Xcode 6. The Xcode Command Line Tools include a GCC compiler. m extension). 10 / Xcode 6. The mini-map includes legible text for Mark:, highlighted lines with errors and warnings, source control changes, breakpoints, and highlighted Find results. Clang / ˈ k l æ ŋ / is a compiler front end for the C, C++, Objective-C and Objective-C++ programming languages, as well as the OpenMP, OpenCL, RenderScript and CUDA frameworks. From MacOS High Sierra, Sierra, OS X El Capitan, Yosemite, Mavericks onward, this is now easily possible directly and. Also, in R2016b, XCode 8. 1 Compatible Apple LLVM 5. 2 Unknown Installation Error I follow the instructions to the T. library not found for -llibc++ clang: error: linker command failed with exit code 1 (use -v to see invocation) Sep. New Features Playgrounds. Clang Error Unable To Execute Command Segmentation Fault Core Dumped p currently disabled Please. 9 to xcode 9. Windows: Download Clang 3. Apple constantly develops OS X libraries, sometimes introducing changes that make them incompatible with older compilers (both icc and clang). Xcode’s Clang compiler. Unity is the ultimate game development platform. Am I running into a linker bug or a hole in clang's C++11 support, or is there something wrong with how I'm invoking the mem_fn() and bind() versions? EDIT:. 1 for Windows. It is kind of out of hand @ unity they can only update the prepacked GVR SDK pods folder. 1 running on Mac OS X (10. reddoni wrote:I had one last question, Is PGO supported under LLVM/Clang?. I upgraded my Mac to Xcode 7 and now I can't compile CUDA code anymore because of the following error: [code]nvcc fatal : The version ('70000') of the host compiler ('Apple clang') is not supported[/code] Is there a fix or a workaround for this until Nvidia updates CUDA?. Yes, that was it. For general discussion and news about c++ see r/cpp. I can not build my unity project in Xcode. ThinLTO: Scalable and Incremental LTO ThinLTO was first introduced at EuroLLVM in 2015 , with results shown from a prototype implementation within clang and LLVM. Open Xcode 7 and let it run in the background. Level 2 warns also about calls that might overflow the destination buffer given an argument of sufficient length or magnitude. I don’t know why but I noticed that sometimes it’s enough to run you project in the Xcode, or run it from DerivedData folder , BUT sometimes you need to Archive your project -> Distribute. 4 and Apple clang) crash unable to execute command: Illegal instruction: 4 clang: error: clang frontend. 4 and run it on your device. plug back iphone and run and you are done. Base URL: https://chromium. 8 or higher) to be used to format C/C++, Javascript etc. 1 treats unrecognized command-line options as errors. 1 running on Mac OS X (10. I've updated this pods folder manually to prevent having to update the pods everytime I build on a windows PC. Before you post, please read our sticky on proper code formatting. For instance, you can select several sanitizer tools with conflicting build settings, and Xcode will run all the tests for you and automatically build all the versions you need. --use-checker-build: Switch Xcode to using the clang provided by the specified analyzer build. Together these define how your application is built. I can not build my unity project in Xcode. is based on llvm 7. How can I solve issue with "clang: error: unable to execute command: Segmentation fault: 11" when trying to build in Xcode? I created a game and previously was able to run and test it via Xcode. clang: error: unable to execute command: Bus error: 10 clang: error: linker command failed due to signal (use -v to see invocation) Anyone knows why? The code builds fine on my colleague's machine. Non-Confidential PDF version100067_0612_00_en Arm® Compiler armclang Reference GuideVersion 6. xcode clang error (8). clang: error: linker command failed with exit code 1 (use -v to see invocation) I have already downloaded perl and Xcode on my macbook pro but, how do i make them work together in coding? Question. 1) Or, this has the details on the root cause, and a link to the updated repo. log relative to the nfft installation is attached. i386 clang: error: linker command failed with exit code 1 (use -v to see invocation) const. When I create a basic hello world app, xcode 4. display is defined 3 times and square. 8 which is not matching the requirement. 今天你妹的被cocoapods坑死了,简直不要不要的,再次记录下恶心的东西,版本问题涉及到的报错简直不能忍受,根本不知道发生了什么,一定要记录下看截图·找不到改路径,我去啊,你找不到管我什么事啊啊。. 3 in config, but the webpage showed that my Unity version choice is not compatible with the Xcode version I chose. 1, all clang (mp-clang-3. Clang Static Analyzer. Hi All, I’m new to hacking on clang and I’m trying to build with Xcode. clang: error: linker command failed with exit code 1 Now there's obviously something going on with the C-thingy. Can I please commit the temporary fix as suggested by ram, namely switching to llvm-gcc-4. Polly Documentation, Release 0. I got it working by adding references to the various architectures under the "Valid Architectures" field of the "Build Settings" for both my project and the referenced CordovaLib project. Asking for help, clarification, or responding to other answers. Go to the build log (click the last icon across the top of the navigator pane), expand the transcript with the error, and if necessary click the details icon to see the error message(s) produced by the linker. In Xcode projects we recommend using Intel compiler to compile C/C++ code while letting Clang compiler to process Objective-C (via creating Build Rules for C/C++). Stack Exchange network consists of 175 Q&A communities including Stack Overflow, the largest, most trusted online community for developers to learn, share their knowledge, and build their careers. 1 cannot be imported in Swift 3. clang: error: linker command failed with exit code 1 (use -v to see invocation) I have already downloaded perl and Xcode on my macbook pro but, how do i make them work together in coding? Question. The unity short and long log of unity build cloud doesn't give any specific detail: 2266: [xcode] clang: error: linker command failed with exit code 1 (use -v to see invocation) 2267: [xcode] ** BUILD FAILED **. At level 2, unknown numeric arguments are assumed to have the minimum representable value for signed types with a precision greater than 1, and the maximum representable value otherwise. Language Compatibility. I am very Shell Script Invocation Error: Command /bin/sh. --use-xcode-clang: Switch Xcode (back) to using the clang that came bundled with it for static analysis. 4 and placed it in Applications with different name. Unity is the ultimate game development platform. Error message: Ld /Users/life/Library/Developer. Problem is that main. It doesn't install on the Simulators but. 1, those Server What is the difference between a point transformation and a vector transformation?. GitHub is home to over 40 million developers working together to host and review code, manage projects, and build software together. I have been assigned a task to archive an existing project using xcode's Product >> Archive. html files, info-plist etc) in XCode before compiling the. 2 (available with Mac OX 10. Apple constantly develops OS X libraries, sometimes introducing changes that make them incompatible with older compilers (both icc and clang). Some of these things can't be done in Appery. 28)) 해당 에러는 이전 버전의 Xcode 에서 빌드된 Pre Compiled Header 가 업데이트 된 Xcode 버전에서 빌. cpp and trying to link B. bzl and is guarded by our (arguably quite naive :) autodetection logic. It is documented on page 254 of The C Programming Language, Second Edition. Hello, I'm a developer with the MacPorts project. Recently I moved my project to a fresh installation of macOS. A remote user can bypass security controls on the target system. The same file is processed without errors using the legacy GNU-based assembler from Xcode 6. 40) (based on for architecture x86_64 _ clang: error: linker command failed with exit code 1 (use. But it doesn't change because of duplicate. I upgraded my Mac to Xcode 7 and now I can't compile CUDA code anymore because of the following error: [code]nvcc fatal : The version ('70000') of the host compiler ('Apple clang') is not supported[/code] Is there a fix or a workaround for this until Nvidia updates CUDA?. Thanks for your reply. mk but didn't have llvm-g++ (tried to install it but lost like 2 hours for nothing, because it doesn't come anymore with XCode and compiling it from llvm. Xcode!!! clang: error: no such file or directory: Now, I opened it in XCode 6. clang: error: unknown argument: '-mno-fused-madd' The problem seems to be the latest (5. Apple LLVM Compiler has no featured content yet. 0, Corona Enterprise build 2015. Here are some tips on dealing with errors you'll find in Xcode. Use Unity to build high-quality 3D and 2D games, deploy them across mobile, desktop, VR/AR, consoles or the Web, and connect with loyal and enthusiastic players and customers. I upgraded my Mac to Xcode 7 and now I can't compile CUDA code anymore because of the following error: [code]nvcc fatal : The version ('70000') of the host compiler ('Apple clang') is not supported[/code] Is there a fix or a workaround for this until Nvidia updates CUDA?. 阅读数 24058. Apple may provide or recommend responses as a possible solution based on the information provided; every potential issue may involve several factors not detailed in the conversations captured in an electronic forum and Apple can therefore provide no guarantee as to the. My issue is that when I try to build my app (while connected to my physical iPhone), I am getting linker errors, specifically: "clang: error: No such file … 'lto. There’s so much more you can do. @mrjj Release version of 5. 1 for Windows. Before proceeding, be aware that Xcode is a large download—nearly 752MB, to be. Steps to Reproduce Create a new app Run flutter: flutter run Logs Launching lib/main. 1,然后调试接了一台iPhone4,一台iPhone5,(原来只用iPhone4开发) 选择iPhone4可以成功编译; 但iPhone5编译出现以下错误:clang: error: linker command failed with exit code 1 (use -v to see. Hello, I have some trouble building on XCode 9 for ios11 a project from the sample HelloARSlam from with libc++ and BITCODE. If you do want to work on the command line, you may as well just use the "clang" program instead. I am compiling with those flag: -std=c++0x -stdlib=libc++ This -stdlib=libc++ is to enable the rewrite of stl for clang, unfortunatly if i enable it clang can't find any std include. 参考: iOS 开发报错 clang: error: unable to execute command: Segmentation fault: 11 – 博客频道 – CSDN. 3, released last week) referred to in that post does *not* make gcc-4. What version of Xcode are we talking about here? I notice that your system is trying to compile with clang, while mine (Xcode 4. I used the following command to generate the Xcode project: cmake -G Xcode. Please visit our new forums to participate in discussion. 1 and a project that when exporting it to Xcode can build without problems, the problem occurs when I add the Google Play services extension of the Market. Close Mobile Search. as -arch i386 -force_cpusubtype_ALL -o natArray. You can both compile and run your program using Xcode, or you can use the Clang Objective-C compiler in a Terminal window. 3 is the most recent version and Xcode 4 has always been somewhat problematic for Python builds. But I don't see stdarg. I installed xcode, llvm, brew, and I have clang on my system but not clangd , I googled around and only find how install clang not clangd. clang: error: linker command failed with exit code 1 Now there's obviously something going on with the C-thingy. clang: error: linker command failed with exit Learn more about matlab, xcode, mex compiler, mex, mac MATLAB. error: command line tools are already installed, use "Software Update" to install updates". Problem with building Clang and LLVM using Xcode. There are several ways to install CMake, depending on your platform. 0 You have until march 2019 to upload with those tips, and now (inmediatly) move everything you made on easyAR to vuforia. "libc++" C++ Standard Library. Xcode 5 Llvm Error I also tried uninstalling and re installing the project but nothing happened, this error happens with all my xCode projects (iOS and.